Oskar Fischinger

Fischinger, Oskar
type: Thing
type: Concept
in set: gtaa
status: approved
date accepted: 2007-11-24T00:50:42+00:00
date submitted: 2007-11-24T00:50:42+00:00
modified: 2024-05-27T08:16:18+00:00
in scheme: Persoonsnamen
notation: 98961
scope note: animatiefilmer, tekenaar, kunstschilder Duitsland
sd license: https://creativecommons.org/publicdomain/zero/1.0/
sd publisher: www.beeldengeluid.nl

Thing
type: Class

Oskar Fischinger
type: Label

Fischinger, Oskar
type: Label