Davis, Jefferson
type: Concept
type: Thing
in set: gtaa
status: approved
date accepted: 2007-11-23T23:52:54+00:00
date submitted: 2007-11-23T23:52:54+00:00
modified: 2023-04-05T08:42:21+00:00
in scheme: Persoonsnamen
notation: 92046
scope note: president zuidelijke staten VS 19de eeuw
sd license: https://creativecommons.org/publicdomain/zero/1.0/
sd publisher: www.beeldengeluid.nl

Davis, Jefferson
type: Label

Jefferson Davis

Thing
type: Class

Jefferson Davis
type: Label