Charcot, Jean
type: Thing
type: Concept
in set: gtaa
status: approved
date accepted: 2007-11-23T23:30:24+00:00
date submitted: 2007-11-23T23:30:24+00:00
modified: 2023-04-05T08:33:42+00:00
in scheme: Persoonsnamen
notation: 89080
scope note: Frans poolreiziger, oceanograaf, medicus 1867-1936
sd license: https://creativecommons.org/publicdomain/zero/1.0/
sd publisher: www.beeldengeluid.nl

Jean Charcot
type: Label

Charcot, Jean
type: Label

Jean-Baptiste Charcot

Thing
type: Class