Bouillon, Godfried van
type: Label

van Bouillon, Godfried
type: Label

Thing
type: Class

Bouillon, Godfried van
type: Concept
type: Thing
in set: gtaa
status: approved
date accepted: 2007-11-23T23:01:49+00:00
date submitted: 2007-11-23T23:01:49+00:00
modified: 2023-04-05T09:36:05+00:00
in scheme: Persoonsnamen
notation: 85033
scope note: hertog Neder-Lotharingen, leider Eerste Kruistocht
sd license: https://creativecommons.org/publicdomain/zero/1.0/
sd publisher: www.beeldengeluid.nl

Godfried van Bouillon
type: Label

Godfrey of Bouillon