Baruch, Bernard
type: Concept
type: Thing
in set: gtaa
status: approved
date accepted: 2007-11-23T22:30:59+00:00
date submitted: 2007-11-23T22:30:59+00:00
modified: 2023-04-05T09:54:03+00:00
in scheme: Persoonsnamen
notation: 80206
scope note: financier, investeerder, filantroop, staatsman en politiek adviseur
sd license: https://creativecommons.org/publicdomain/zero/1.0/
sd publisher: www.beeldengeluid.nl

Bernard Baruch
type: Label

Bernard Mannes Baruch

Bernard Mannes Baruch
type: Label

Thing
type: Class

Baruch, Bernard
type: Label