Giulio Carlo Argan
type: Label

Argan, Giulio Carlo
type: Thing
type: Concept
in set: gtaa
status: approved
date accepted: 2007-11-23T22:18:56+00:00
date submitted: 2007-11-23T22:18:56+00:00
modified: 2023-04-05T08:12:14+00:00
in scheme: Persoonsnamen
notation: 78157
scope note: hoogleraar kunsthistorie Turijn, burgemeester Rome
sd license: https://creativecommons.org/publicdomain/zero/1.0/
sd publisher: www.beeldengeluid.nl

Argan, Giulio Carlo
type: Label

Giulio Carlo Argan

Thing
type: Class