Thing
type: Class

Abdel-Rahman, Omar
type: Label

Omar Abdel-Rahman
type: Label

Abdel-Rahman, Omar
type: Thing
type: Concept
in set: gtaa
status: approved
date accepted: 2007-11-23T22:01:41+00:00
date submitted: 2007-11-23T22:01:41+00:00
modified: 2023-04-05T09:06:00+00:00
in scheme: Persoonsnamen
notation: 75101
scope note: leider fundamentalistische moslims Egypte
sd license: https://creativecommons.org/publicdomain/zero/1.0/
sd publisher: www.beeldengeluid.nl

Omar Abdel-Rahman