Sills, Beverly
type: Label

Sills, Beverly
type: Person
type: Concept
in set: gtaa
status: approved
date accepted: 2018-03-14T13:59:30+00:00
date submitted: 2016-05-23T13:32:46+00:00
modified: 2024-05-27T07:50:30+00:00
in scheme: Persoonsnamen
notation: 269140
scope note: zangeres, pseudoniem van Belle Miriam Silverman
sd license: https://creativecommons.org/publicdomain/zero/1.0/
sd publisher: www.beeldengeluid.nl

Hills, Beverly
type: Label

Person
type: Class

Beverly Sills
type: Label

Beverly Sills