Luciano Sgrizzi

Sgrizzi, Luciano?
type: Label

Person
type: Class

Luciano Sgrizzi
type: Label

Sgrizzi, Luciano
type: Label

Sgrizzi, Luciano
type: Concept
type: Person
in set: gtaa
status: approved
date accepted: 2018-03-06T11:36:37+00:00
date submitted: 2016-05-20T09:20:06+00:00
modified: 2024-05-27T08:09:56+00:00
in scheme: Persoonsnamen
notation: 264216
scope note: klavecinist, organist, pianist, componist
sd license: https://creativecommons.org/publicdomain/zero/1.0/
sd publisher: www.beeldengeluid.nl