Vallance, Jim
type: Person
type: Concept
in set: gtaa
status: approved
date accepted: 2018-01-08T14:55:12+00:00
date submitted: 2016-05-04T15:11:52+00:00
modified: 2024-05-27T07:58:26+00:00
in scheme: Persoonsnamen
notation: 263385
scope note: muzikant, tekstschrijver, muziekproducer
sd license: https://creativecommons.org/publicdomain/zero/1.0/
sd publisher: www.beeldengeluid.nl

Vallance, Jim
type: Label

Jim Vallance
type: Label

Jim Vallance

Person
type: Class