Mina (zangeres)
type: Label

Mina (zangeres)
type: Person
type: Concept
in set: gtaa
qualifier: zangeres
status: approved
date accepted: 2018-03-08T13:22:48+00:00
date submitted: 2016-05-02T13:18:42+00:00
modified: 2023-04-05T09:05:14+00:00
in scheme: Persoonsnamen
notation: 263045
scope note: zangeres, artiestennaam van Mina Anna Mazzini
sd license: https://creativecommons.org/publicdomain/zero/1.0/
sd publisher: www.beeldengeluid.nl

Mina Anna Mazzini
type: Label

Mina

Mazzini, Mina Anna
type: Label

Person
type: Class