Aloysio de Oliveira
type: Label

Oliveira, Aloysio de
type: Person
type: Concept
in set: gtaa
status: approved
date accepted: 2017-09-06T11:56:56+00:00
date submitted: 2016-04-20T14:13:10+00:00
modified: 2024-05-24T08:37:09+00:00
in scheme: Persoonsnamen
notation: 262683
scope note: muziekproducer, zanger, tekstschrijver, componist
sd license: https://creativecommons.org/publicdomain/zero/1.0/
sd publisher: www.beeldengeluid.nl

de Oliveira, Aloysio
type: Label

Aloísio de Oliveira

Person
type: Class

Oliveira, Aloysio de
type: Label