Masser, Michael
type: Label

Masser, Michael
type: Concept
type: Person
in set: gtaa
status: approved
date accepted: 2017-10-11T12:46:34+00:00
date submitted: 2016-04-20T09:26:42+00:00
modified: 2024-05-24T08:22:06+00:00
in scheme: Persoonsnamen
notation: 262594
scope note: tekstschrijver, componist, muziekproducer
sd license: https://creativecommons.org/publicdomain/zero/1.0/
sd publisher: www.beeldengeluid.nl

Michael Masser
type: Label

Person
type: Class

Michael Masser