Mélanie Bonis
type: Label

Bonis, Mélanie
type: Concept
type: Person
in set: gtaa
status: approved
date accepted: 2017-11-14T10:37:57+00:00
date submitted: 2016-04-11T14:00:34+00:00
modified: 2025-02-20T07:21:43+00:00
in scheme: Persoonsnamen
notation: 261280
scope note: componist, ook bekend onder pseudoniem Mel Bonis
hidden label: Bonis, Mel
sd license: https://creativecommons.org/publicdomain/zero/1.0/
sd publisher: www.beeldengeluid.nl

Bonis, Mélanie
type: Label

Mélanie Bonis

Bonis, Mel
type: Label

Person
type: Class