Benton, Brook
type: Person
type: Concept
in set: gtaa
status: approved
date accepted: 2016-10-18T12:05:27+00:00
date submitted: 2016-04-05T09:48:31+00:00
modified: 2024-05-24T08:10:28+00:00
in scheme: Persoonsnamen
notation: 260605
scope note: singer-songwriter, artiestennaam van Benjamin Franklin Peay
sd license: https://creativecommons.org/publicdomain/zero/1.0/
sd publisher: www.beeldengeluid.nl

Benton, Brook
type: Label

Brook Benton

Brook Benton
type: Label

Person
type: Class

Brook, Benton
type: Label