Jeff Hanneman

Hanneman, Jeff
type: Label

Hanneman, Jeff
type: Person
type: Concept
in set: gtaa
status: approved
date accepted: 2017-06-12T13:05:35+00:00
date submitted: 2016-03-23T12:02:15+00:00
modified: 2024-05-24T09:00:33+00:00
in scheme: Persoonsnamen
notation: 259958
scope note: muzikant, gitarist, volledige naam Jeffrey John Hanneman
sd license: https://creativecommons.org/publicdomain/zero/1.0/
sd publisher: www.beeldengeluid.nl

Jeff Hanneman
type: Label

Person
type: Class