Thing
type: Class

Kooper, Al
type: Label

Kooper, Al
type: Concept
type: Person
type: Thing
in set: gtaa
status: approved
date accepted: 2017-03-16T10:07:02+00:00
date submitted: 2016-03-04T08:09:48+00:00
modified: 2024-05-24T08:59:08+00:00
in scheme: Persoonsnamen
notation: 258601
scope note: muzikant, artiestennaam van Alan Peter Kuperschmidt, ook bekend onder pseudoniem Roosevelt Gook
sd license: https://creativecommons.org/publicdomain/zero/1.0/
sd publisher: www.beeldengeluid.nl

Al Kooper
type: Label

Al Kooper

Person
type: Class