Bela Jenbach
type: Label

Jenbach, Bela
type: Person
type: Concept
in set: gtaa
status: approved
date accepted: 2016-03-24T10:18:14+00:00
date submitted: 2016-03-01T09:54:31+00:00
modified: 2024-05-24T08:31:49+00:00
in scheme: Persoonsnamen
notation: 258419
scope note: tekstschrijver, artiestennaam van Béla Jacobowicz
sd license: https://creativecommons.org/publicdomain/zero/1.0/
sd publisher: www.beeldengeluid.nl

Jenbach, Bela
type: Label

Person
type: Class

Béla Jenbach

Jacobowicz, Béla
type: Label