Person
type: Class

Chris Cross
type: Label

Cross, Chris
type: Person
type: Concept
in set: gtaa
status: approved
date accepted: 2017-12-08T14:52:54+00:00
date submitted: 2016-02-29T12:54:41+00:00
modified: 2023-04-05T09:36:42+00:00
in scheme: Persoonsnamen
notation: 258368
scope note: basgitarist, componist artiestennaam van Christopher Thomas Allen
sd license: https://creativecommons.org/publicdomain/zero/1.0/
sd publisher: www.beeldengeluid.nl

Cross, Chris
type: Label

Chris Cross