Person
type: Class

Jack Ma

Ma, Jack
type: Person
type: Concept
in set: gtaa
status: approved
date accepted: 2015-11-05T09:08:53+00:00
date submitted: 2015-11-03T14:19:24+00:00
modified: 2023-04-05T09:56:27+00:00
in scheme: Persoonsnamen
notation: 256456
scope note: ondernemer, oprichter internetbedrijf Alibaba
sd license: https://creativecommons.org/publicdomain/zero/1.0/
sd publisher: www.beeldengeluid.nl

Ma Yun
type: Label

Ma, Jack
type: Label

Jack Ma
type: Label