Charlotte (prinses Groot-Brittannië)
type: Concept
type: Thing
in set: gtaa
qualifier: prinses Groot-Brittannië
status: approved
date accepted: 2015-06-16T16:12:34+00:00
date submitted: 2015-05-29T07:54:27+00:00
modified: 2023-04-05T08:32:30+00:00
in scheme: Persoonsnamen
notation: 255735
scope note: prinses van Cambridge, dochter van William en Catherine (Kate)
sd license: https://creativecommons.org/publicdomain/zero/1.0/
sd publisher: www.beeldengeluid.nl

Thing
type: Class

Charlotte van Cambridge
type: Label

Princess Charlotte of Wales

Charlotte (prinses Groot-Brittannië)
type: Label

Charlotte Elizabeth Diana (prinses Groot-Brittannië)
type: Label