Věra Jourová

Jourová, Vera
type: Concept
type: Person
in set: gtaa
status: approved
date accepted: 2015-01-20T09:29:22+00:00
date submitted: 2015-01-19T14:19:49+00:00
modified: 2023-04-05T08:36:50+00:00
in scheme: Persoonsnamen
notation: 255408
scope note: Eurocommissaris, politicus Tsjechië Tsjechische Sociaaldemocratische Partij
sd license: https://creativecommons.org/publicdomain/zero/1.0/
sd publisher: www.beeldengeluid.nl

Person
type: Class

Vera Jourová
type: Label

Jourová, Vera
type: Label