Person
type: Class

Hogan, Phil
type: Label

Hogan, Phil
type: Concept
type: Person
in set: gtaa
status: approved
date accepted: 2015-01-20T09:28:14+00:00
date submitted: 2015-01-19T13:28:50+00:00
modified: 2023-04-05T08:19:18+00:00
in scheme: Persoonsnamen
notation: 255403
scope note: Eurocommissaris, politicus Ierland Fine Gael
sd license: https://creativecommons.org/publicdomain/zero/1.0/
sd publisher: www.beeldengeluid.nl

Phil Hogan
type: Label

Phil Hogan