Hogendorp, Dirk van (1761-1822)
type: Concept
type: Thing
in set: gtaa
qualifier: 1761-1822
status: approved
date accepted: 2014-10-13T09:32:05+00:00
date submitted: 2014-10-13T09:32:05+00:00
modified: 2023-04-05T09:16:32+00:00
in scheme: Persoonsnamen
notation: 240109
scope note: Nederlands militair en staatsman, resident in Oost-Indië
sd license: https://creativecommons.org/publicdomain/zero/1.0/
sd publisher: www.beeldengeluid.nl

Dirk van Hogendorp

Hogendorp, Dirk van (1761-1822)
type: Label

van Hogendorp, Dirk (1761-1822)
type: Label

Dirk van Hogendorp (1761-1822)
type: Label

Thing
type: Class