Dieudonné Nzapalainga

Person
type: Class

Nzapalainga, Dieudonné
type: Label

Dieudonné Nzapalainga
type: Label

Nzapalainga, Dieudonné
type: Concept
type: Person
in set: gtaa
status: approved
date accepted: 2014-01-21T07:23:31+00:00
date submitted: 2014-01-21T06:43:29+00:00
modified: 2023-04-05T09:20:56+00:00
in scheme: Persoonsnamen
notation: 238427
scope note: aartsbisschop Bangui, Centraal-Afrikaanse Republiek
sd license: https://creativecommons.org/publicdomain/zero/1.0/
sd publisher: www.beeldengeluid.nl