Keijzer, Mona
type: Label

Thing
type: Class

Mona Keijzer

Mona Keijzer
type: Label

Person
type: Class

Keijzer, Mona
type: Person
type: Concept
type: Thing
in set: gtaa
status: approved
date accepted: 2012-01-24T13:58:11+00:00
date submitted: 2012-01-24T10:22:24+00:00
modified: 2023-04-05T09:30:10+00:00
in scheme: Persoonsnamen
notation: 231243
scope note: staatssecretaris Economische Zaken en Klimaat CDA, politica CDA, wethouder Purmerend
sd license: https://creativecommons.org/publicdomain/zero/1.0/
sd publisher: www.beeldengeluid.nl