Thing
type: Class

John Jorritsma
type: Label

Jorritsma, John
type: Label

Jorritsma, John
type: Thing
type: Concept
type: Person
in set: gtaa
status: approved
date accepted: 2011-08-11T13:32:25+00:00
date submitted: 2011-07-29T13:50:11+00:00
modified: 2023-04-05T09:56:48+00:00
in scheme: Persoonsnamen
notation: 229145
scope note: commissaris van de koningin van Friesland VVD, directeur Brabantse Ontwikkelingsmaatschappij, burgemeester van Cranendonck
sd license: https://creativecommons.org/publicdomain/zero/1.0/
sd publisher: www.beeldengeluid.nl

John Jorritsma

Person
type: Class