Thing
type: Class

Mesut Yilmaz
type: Label

Mesut Yılmaz

Yilmaz, Mesut
type: Concept
type: Thing
in set: gtaa
status: approved
date accepted: 2007-11-24T18:37:46+00:00
date submitted: 2007-11-24T18:37:46+00:00
modified: 2023-04-05T08:31:09+00:00
in scheme: Persoonsnamen
notation: 172174
scope note: politicus Turkije leider Moederlandpartij premier
sd license: https://creativecommons.org/publicdomain/zero/1.0/
sd publisher: www.beeldengeluid.nl

Yilmaz, Mesut
type: Label