Kim Yo-jong
type: Concept
type: Thing
in set: gtaa
status: approved
date accepted: 2018-05-08T14:56:48+00:00
date submitted: 2018-02-12T12:17:26+00:00
modified: 2023-04-05T08:11:55+00:00
in scheme: Persoonsnamen
notation: 1709315
scope note: zus van leider Kim Jong-un van Noord-Korea
sd license: https://creativecommons.org/publicdomain/zero/1.0/
sd publisher: www.beeldengeluid.nl

Thing
type: Class

Kim Yo-jong

Kim Yo-jong
type: Label

Kim Yo Jong
type: Label