Trump, Ivanka
type: Person
type: Concept
in set: gtaa
status: approved
date accepted: 2017-09-20T15:33:58+00:00
date submitted: 2017-04-26T07:40:13+00:00
modified: 2023-04-05T08:17:02+00:00
in scheme: Persoonsnamen
notation: 1672456
scope note: model, ondernemer, dochter van president Trump VS
sd license: https://creativecommons.org/publicdomain/zero/1.0/
sd publisher: www.beeldengeluid.nl

Ivanka Trump
type: Label

Trump, Ivanka
type: Label

Ivanka Trump

Person
type: Class