Suenens, Leo Jozef
type: Concept
type: Thing
in set: gtaa
status: approved
date accepted: 2007-11-24T14:32:06+00:00
date submitted: 2007-11-24T14:32:06+00:00
modified: 2023-04-05T08:40:43+00:00
in scheme: Persoonsnamen
notation: 159150
scope note: geestelijk leider België, aartsbisschop Mechelen
sd license: https://creativecommons.org/publicdomain/zero/1.0/
sd publisher: www.beeldengeluid.nl

Leo Jozef Suenens
type: Label

Suenens, L.J.
type: Label

Suenens, Leo Jozef
type: Label

Thing
type: Class

Leo Joseph Suenens