Shafei, Hussein El-
type: Thing
type: Concept
in set: gtaa
status: approved
date accepted: 2007-11-24T12:46:16+00:00
date submitted: 2007-11-24T12:46:16+00:00
modified: 2023-04-05T08:51:20+00:00
in scheme: Persoonsnamen
notation: 153065
scope note: politicus/legeroff. Egypte, vice-president
sd license: https://creativecommons.org/publicdomain/zero/1.0/
sd publisher: www.beeldengeluid.nl

Shafei, Hussein El-
type: Label

Thing
type: Class

Hussein El- Shafei
type: Label

Hussein el-Shafei