Schoof, Dick
type: Label

Dick Schoof
type: Label

Thing
type: Class

Person
type: Class

Schoof, Dick
type: Person
type: Concept
type: Thing
in set: gtaa
status: approved
date accepted: 2007-11-24T12:20:35+00:00
date submitted: 2007-11-24T12:20:35+00:00
modified: 2025-11-05T12:36:03+00:00
in scheme: Persoonsnamen
notation: 151550
scope note: minister-president, Nationaal Coördinator Terrorismebestrijding en Veiligheid, directeur IND
sd license: https://creativecommons.org/publicdomain/zero/1.0/
sd publisher: www.beeldengeluid.nl