Rivera y Damas, Arturo
type: Label

Thing
type: Class

Arturo Rivera y Damas

Rivera y Damas, Arturo
type: Thing
type: Concept
in set: gtaa
status: approved
date accepted: 2007-11-24T10:57:22+00:00
date submitted: 2007-11-24T10:57:22+00:00
modified: 2023-04-05T08:20:49+00:00
in scheme: Persoonsnamen
notation: 146499
scope note: geestelijk leider El Salvador aartsbisschop
sd license: https://creativecommons.org/publicdomain/zero/1.0/
sd publisher: www.beeldengeluid.nl

Arturo Rivera y Damas
type: Label