Kukrit Pramoj

Thing
type: Class

Pramoj, Kukrit
type: Thing
type: Concept
in set: gtaa
status: approved
date accepted: 2007-11-24T10:09:00+00:00
date submitted: 2007-11-24T10:09:00+00:00
modified: 2023-04-05T09:36:28+00:00
in scheme: Persoonsnamen
notation: 143436
scope note: politicus Thailand, premier, broer van Seni
sd license: https://creativecommons.org/publicdomain/zero/1.0/
sd publisher: www.beeldengeluid.nl

Pramoj, Kukrit
type: Label

Kukrit Pramoj
type: Label