Paul (prins-regent Joegoslavië)
type: Label

Thing
type: Class

Prince Paul of Yugoslavia

Paul (prins-regent Joegoslavië)
type: Thing
type: Concept
in set: gtaa
qualifier: prins-regent Joegoslavië
status: approved
date accepted: 2007-11-24T09:24:55+00:00
date submitted: 2007-11-24T09:24:55+00:00
modified: 2023-04-05T09:16:13+00:00
in scheme: Persoonsnamen
notation: 140561
scope note: broer van koning Alexander van Joegoslavië
sd license: https://creativecommons.org/publicdomain/zero/1.0/
sd publisher: www.beeldengeluid.nl