Thing
type: Class

Ortega, Humberto
type: Label

Humberto Ortega
type: Label

Ortega, Humberto
type: Thing
type: Concept
in set: gtaa
status: approved
date accepted: 2007-11-24T08:59:52+00:00
date submitted: 2007-11-24T08:59:52+00:00
modified: 2023-04-05T08:57:54+00:00
in scheme: Persoonsnamen
notation: 138904
scope note: leger Nicaragua generaal ex-min. defensie
sd license: https://creativecommons.org/publicdomain/zero/1.0/
sd publisher: www.beeldengeluid.nl

Humberto Ortega