Kajsa Ollongren
type: Label

Person
type: Class

Kajsa Ollongren

Thing
type: Class

Ollongren, Kajsa
type: Label

Ollongren, Kajsa
type: Thing
type: Concept
type: Person
in set: gtaa
status: approved
date accepted: 2017-05-22T11:04:49+00:00
date submitted: 2016-07-13T15:57:12+00:00
modified: 2023-04-05T08:15:17+00:00
in scheme: Persoonsnamen
notation: 1385152
scope note: minister van Defensie (Rutte IV), minister van Binnenlandse Zaken D66, locoburgemeester en wethouder Amsterdam
sd license: https://creativecommons.org/publicdomain/zero/1.0/
sd publisher: www.beeldengeluid.nl