Thing
type: Class

Lazar Mojsov

Mojsov, Lazar
type: Thing
type: Concept
in set: gtaa
status: approved
date accepted: 2007-11-24T07:39:24+00:00
date submitted: 2007-11-24T07:39:24+00:00
modified: 2023-04-05T09:01:50+00:00
in scheme: Persoonsnamen
notation: 133383
scope note: journalist/politicus/diplomaat Joegoslavië
sd license: https://creativecommons.org/publicdomain/zero/1.0/
sd publisher: www.beeldengeluid.nl

Mojsov, Lazar
type: Label

Lazar Mojsov
type: Label