Rene Mayer
type: Label

Thing
type: Class

René Mayer

Mayer, Rene
type: Label

Mayer, René
type: Label

Mayer, Rene
type: Concept
type: Thing
in set: gtaa
status: approved
date accepted: 2007-11-24T07:01:49+00:00
date submitted: 2007-11-24T07:01:49+00:00
modified: 2023-04-05T09:27:28+00:00
in scheme: Persoonsnamen
notation: 130693
scope note: politicus Frankrijk, voorzitter EGKS (Europese Gemeenschap voor Kolen en Staal)
sd license: https://creativecommons.org/publicdomain/zero/1.0/
sd publisher: www.beeldengeluid.nl