Malile, Reis
type: Label

Reis Malile
type: Label

Malile, Reis
type: Thing
type: Concept
in set: gtaa
status: approved
date accepted: 2007-11-24T06:41:18+00:00
date submitted: 2007-11-24T06:41:18+00:00
modified: 2023-04-05T09:47:12+00:00
in scheme: Persoonsnamen
notation: 129196
scope note: politicus Albanië min. buitenlandse zaken
sd license: https://creativecommons.org/publicdomain/zero/1.0/
sd publisher: www.beeldengeluid.nl

Thing
type: Class

Reiz Malile