John Malecela
type: Label

Malecela, John
type: Label

John Malecela

Malecela, John
type: Thing
type: Concept
in set: gtaa
status: approved
date accepted: 2007-11-24T06:40:50+00:00
date submitted: 2007-11-24T06:40:50+00:00
modified: 2023-04-05T09:27:40+00:00
in scheme: Persoonsnamen
notation: 129162
scope note: politicus Tanzania, Min. van Buitenlandse Zaken
sd license: https://creativecommons.org/publicdomain/zero/1.0/
sd publisher: www.beeldengeluid.nl

Thing
type: Class