al Magid, Ali Hassan
type: Label

Ali Hassan al Magid
type: Label

Magid, Ali Hassan al
type: Thing
type: Concept
in set: gtaa
status: approved
date accepted: 2007-11-24T06:36:56+00:00
date submitted: 2007-11-24T06:36:56+00:00
modified: 2023-04-05T08:28:08+00:00
in scheme: Persoonsnamen
notation: 128874
scope note: politicus Irak minister binnenlandse zaken
sd license: https://creativecommons.org/publicdomain/zero/1.0/
sd publisher: www.beeldengeluid.nl

Magid, Ali Hassan al
type: Label

Thing
type: Class

Ali Hassan al-Majid