Thing
type: Class

Medek, Ivan
type: Label

Ivan Medek
type: Label

Medek, Ivan
type: Thing
type: Concept
in set: gtaa
status: approved
date accepted: 2007-11-24T06:23:32+00:00
date submitted: 2007-11-24T06:23:32+00:00
modified: 2023-04-05T08:52:28+00:00
in scheme: Persoonsnamen
notation: 127873
scope note: uitgeweken Tsjechische auteur & Charta-lid
sd license: https://creativecommons.org/publicdomain/zero/1.0/
sd publisher: www.beeldengeluid.nl

Ivan Medek