Thing
type: Class

Mancino, Nicola
type: Label

Mancino, Nicola
type: Concept
type: Thing
in set: gtaa
status: approved
date accepted: 2007-11-24T06:22:32+00:00
date submitted: 2007-11-24T06:22:32+00:00
modified: 2023-04-05T09:31:06+00:00
in scheme: Persoonsnamen
notation: 127798
scope note: politicus Italië min. binnenlandse zaken
sd license: https://creativecommons.org/publicdomain/zero/1.0/
sd publisher: www.beeldengeluid.nl

Nicola Mancino
type: Label

Nicola Mancino