Bernard Lown
type: Label

Bernard Lown

Lown, Bernard
type: Thing
type: Concept
type: Person
in set: gtaa
status: approved
date accepted: 2007-11-24T05:53:16+00:00
date submitted: 2007-11-24T05:53:16+00:00
modified: 2023-04-05T08:36:29+00:00
in scheme: Persoonsnamen
notation: 125566
scope note: cardioloog, oprichter International Physicians for the Prevention of Nuclear War, winnaar Nobelprijs voor de Vrede 1985
sd license: https://creativecommons.org/publicdomain/zero/1.0/
sd publisher: www.beeldengeluid.nl

Person
type: Class

Lown, Bernard
type: Label

Thing
type: Class