Thing
type: Class

Lotz, Wolfgang
type: Label

Wolfgang Lotz

Wolfgang Lotz
type: Label

Lotz, Wolfgang
type: Concept
type: Thing
in set: gtaa
status: approved
date accepted: 2007-11-24T05:51:14+00:00
date submitted: 2007-11-24T05:51:14+00:00
modified: 2023-04-05T09:58:06+00:00
in scheme: Persoonsnamen
notation: 125409
scope note: alias Zeev Gur Arieh, ex-geheim agent Mossad
sd license: https://creativecommons.org/publicdomain/zero/1.0/
sd publisher: www.beeldengeluid.nl