Kovacs, Laszlo
type: Label

Laszlo Kovacs
type: Label

László Kovács

Person
type: Class

Kovacs, Laszlo
type: Person
type: Concept
in set: gtaa
status: approved
date accepted: 2007-11-24T05:03:18+00:00
date submitted: 2007-11-24T05:03:18+00:00
modified: 2023-04-05T08:36:52+00:00
in scheme: Persoonsnamen
notation: 121610
scope note: EU commissaris belasting en douane, minister van Buitenlandse Zaken Hongarije
sd license: https://creativecommons.org/publicdomain/zero/1.0/
sd publisher: www.beeldengeluid.nl