Ahmad Khomeini

Thing
type: Class

Khomeini, Ahmad
type: Label

Khomeini, Ahmad
type: Thing
type: Concept
in set: gtaa
status: approved
date accepted: 2007-11-24T04:27:11+00:00
date submitted: 2007-11-24T04:27:11+00:00
modified: 2023-04-05T08:25:40+00:00
in scheme: Persoonsnamen
notation: 118613
scope note: lid Nationale Veiligheidsraad Iran, chef staf van zijn vader Ruhollah Khomeini
sd license: https://creativecommons.org/publicdomain/zero/1.0/
sd publisher: www.beeldengeluid.nl

Ahmad Khomeini
type: Label