Czesław Kiszczak

Kiszczak, Czeslaw
type: Label

Czeslaw Kiszczak
type: Label

Kiszczak, Czeslaw
type: Thing
type: Concept
in set: gtaa
status: approved
date accepted: 2007-11-24T04:06:31+00:00
date submitted: 2007-11-24T04:06:31+00:00
modified: 2023-04-05T09:04:46+00:00
in scheme: Persoonsnamen
notation: 116851
scope note: politicus Polen ex-min. binnenlandse zaken
sd license: https://creativecommons.org/publicdomain/zero/1.0/
sd publisher: www.beeldengeluid.nl

Thing
type: Class